Target
Kappa-type opioid receptor
Ligand
BDBM50544339
Substrate
Meas. Tech.
ChEMBL_1992303 (CHEMBL4626038)
EC50
<7943±n/a nM
Citation
 Cooper, MLlinas, AHansen, PCaffrey, MRay, ASjödin, SShamovsky, IWada, HJellesmark Jensen, TSivars, UHultin, LAndersson, ULundqvist, SGedda, KJinton, LKrutrök, NLewis, RJansson, PGardelli, C Identification and Optimization of Pyrrolidine Derivatives as Highly Potent Ghrelin Receptor Full Agonists. J Med Chem 63:9705-9730 (2020)  
Target
Name:
Kappa-type opioid receptor
Synonyms:
KOR-1 OPIATE Kappa Opioid receptor Ror-d
Type:
G Protein-Coupled Receptor (GPCR)
Mol. Mass.:
42692.90
Organism:
Rattus norvegicus (rat)
Description:
P34975
Residue:
380
  
Inhibitor
Name:
BDBM50544339
Synonyms:
CHEMBL4639379
Type:
Small organic molecule
Emp. Form.:
C24H28N4O2
Mol. Mass.:
404.5047
SMILES:
CN(C)CCNC(=O)[C@@H]1[C@H](Cc2ccccc12)NC(=O)c1cc2cc(C)ccc2[nH]1
: