Target
Kappa-type opioid receptor
Ligand
BDBM50544378
Substrate
Meas. Tech.
ChEMBL_1992303 (CHEMBL4626038)
EC50
<100000±n/a nM
Citation
 Cooper, MLlinas, AHansen, PCaffrey, MRay, ASjödin, SShamovsky, IWada, HJellesmark Jensen, TSivars, UHultin, LAndersson, ULundqvist, SGedda, KJinton, LKrutrök, NLewis, RJansson, PGardelli, C Identification and Optimization of Pyrrolidine Derivatives as Highly Potent Ghrelin Receptor Full Agonists. J Med Chem 63:9705-9730 (2020)  
Target
Name:
Kappa-type opioid receptor
Synonyms:
KOR-1 OPIATE Kappa Opioid receptor Ror-d
Type:
G Protein-Coupled Receptor (GPCR)
Mol. Mass.:
42692.90
Organism:
Rattus norvegicus (rat)
Description:
P34975
Residue:
380
  
Inhibitor
Name:
BDBM50544378
Synonyms:
CHEMBL4639111
Type:
Small organic molecule
Emp. Form.:
C26H28ClN5O5S
Mol. Mass.:
558.049
SMILES:
Clc1ccccc1-c1cc(no1)C(=O)N[C@H]1CN(C[C@@H]1C(=O)N[C@H]1CCCNC1)S(=O)(=O)c1ccccc1
: