Target
Prostaglandin E2 receptor EP2 subtype
Ligand
BDBM50101845
Substrate
Meas. Tech.
ChEBML_158310
Ki
3100±n/a nM
Citation
 Maruyama, TAsada, MShiraishi, TIshida, AEgashira, HYoshida, HMaruyama, TOhuchida, SNakai, HKondo, KToda, M Design and synthesis of a highly selective EP4-receptor agonist. Part 1: 3,7-dithiaPG derivatives with high selectivity. Bioorg Med Chem Lett 11:2029-31 (2001)  
Target
Name:
Prostaglandin E2 receptor EP2 subtype
Synonyms:
PE2R2_MOUSE Prostaglandin E2 Prostanoid EP2 receptor Ptgerep2
Type:
G-protein coupled receptor
Mol. Mass.:
40495.26
Organism:
Mus musculus (Mouse)
Description:
Residue:
362
  
Inhibitor
Name:
BDBM50101845
Synonyms:
CHEMBL62779 | [3-((1R,2S,3R)-3-Hydroxy-2-{(E)-(S)-3-hydroxy-4-[3-(2-methoxy-ethyl)-phenyl]-but-1-enyl}-5-oxo-cyclopentylsulfanyl)-propylsulfanyl]-acetic acid
Type:
Small organic molecule
Emp. Form.:
C23H32O6S2
Mol. Mass.:
468.627
SMILES:
COCCc1cccc(C[C@H](O)\C=C\[C@H]2[C@H](O)CC(=O)[C@@H]2SCCCSCC(O)=O)c1
: