Target
Prostaglandin E2 receptor EP3 subtype
Ligand
BDBM50101855
Substrate
Meas. Tech.
ChEBML_158325
Ki
740±n/a nM
Citation
 Maruyama, TAsada, MShiraishi, TSakata, KSeki, AYoshida, HShinagawa, YMaruyama, TOhuchida, SNakai, HKondo, KToda, M Design and synthesis of a highly selective EP4-receptor agonist. Part 2: 5-thia and 9beta-haloPG derivatives with improved stability. Bioorg Med Chem Lett 11:2033-5 (2001)  
Target
Name:
Prostaglandin E2 receptor EP3 subtype
Synonyms:
PE2R3_MOUSE Prostaglandin E2 receptor EP3 isoform alpha Prostanoid EP3 receptor Ptgerep3
Type:
G-protein coupled receptor
Mol. Mass.:
40092.50
Organism:
Mus musculus (Mouse)
Description:
Residue:
365
  
Inhibitor
Name:
BDBM50101855
Synonyms:
7-{(1R,2R,3R,5R)-5-Chloro-3-hydroxy-2-[(E)-(S)-3-hydroxy-4-(3-methoxymethyl-phenyl)-but-1-enyl]-cyclopentyl}-heptanoic acid | CHEMBL60894
Type:
Small organic molecule
Emp. Form.:
C24H35ClO5
Mol. Mass.:
438.985
SMILES:
COCc1cccc(C[C@H](O)\C=C\[C@H]2[C@H](O)C[C@@H](Cl)[C@@H]2CCCCCCC(O)=O)c1
: