Target
Prostaglandin E2 receptor EP1 subtype
Ligand
BDBM50101860
Substrate
Meas. Tech.
ChEBML_158295
Ki
200±n/a nM
Citation
 Maruyama, TAsada, MShiraishi, TSakata, KSeki, AYoshida, HShinagawa, YMaruyama, TOhuchida, SNakai, HKondo, KToda, M Design and synthesis of a highly selective EP4-receptor agonist. Part 2: 5-thia and 9beta-haloPG derivatives with improved stability. Bioorg Med Chem Lett 11:2033-5 (2001)  
Target
Name:
Prostaglandin E2 receptor EP1 subtype
Synonyms:
PE2R1_MOUSE Prostaglandin E1 Prostanoid EP1 receptor Ptgerep1
Type:
G-protein coupled receptor
Mol. Mass.:
43000.62
Organism:
Mus musculus (Mouse)
Description:
Residue:
405
  
Inhibitor
Name:
BDBM50101860
Synonyms:
CHEMBL64188 | {(S)-4-[(R)-3-Hydroxy-2-((1R,2R)-3-hydroxy-oct-1-enyl)-5-oxo-cyclopentyl]-butylsulfanyl}-acetic acid
Type:
Small organic molecule
Emp. Form.:
C19H32O5S
Mol. Mass.:
372.519
SMILES:
CCCCC[C@H](O)\C=C\[C@H]1[C@H](O)CC(=O)[C@@H]1CCCCSCC(O)=O
: