Target
Prostaglandin E2 receptor EP4 subtype
Ligand
BDBM50101865
Substrate
Meas. Tech.
ChEMBL_158451 (CHEMBL763255)
Ki
7.7±n/a nM
Citation
 Maruyama, TAsada, MShiraishi, TSakata, KSeki, AYoshida, HShinagawa, YMaruyama, TOhuchida, SNakai, HKondo, KToda, M Design and synthesis of a highly selective EP4-receptor agonist. Part 2: 5-thia and 9beta-haloPG derivatives with improved stability. Bioorg Med Chem Lett 11:2033-5 (2001)  
Target
Name:
Prostaglandin E2 receptor EP4 subtype
Synonyms:
PE2R4_MOUSE Prostanoid EP4 receptor Ptgerep4
Type:
G-protein coupled receptor
Mol. Mass.:
56175.66
Organism:
Mus musculus (Mouse)
Description:
Residue:
513
  
Inhibitor
Name:
BDBM50101865
Synonyms:
(E)-7-{(1R,2R,3R,5R)-5-Chloro-3-hydroxy-2-[(E)-(S)-3-hydroxy-4-(4-hydroxy-3-methyl-phenyl)-but-1-enyl]-cyclopentyl}-hept-5-enoic acid | CHEMBL63061
Type:
Small organic molecule
Emp. Form.:
C23H31ClO5
Mol. Mass.:
422.942
SMILES:
Cc1cc(C[C@H](O)\C=C\[C@H]2[C@H](O)C[C@@H](Cl)[C@@H]2C\C=C\CCCC(O)=O)ccc1O
: