Target
Prostacyclin receptor
Ligand
BDBM50101836
Substrate
Meas. Tech.
ChEBML_158469
Ki
870±n/a nM
Citation
 Maruyama, TAsada, MShiraishi, TSakata, KSeki, AYoshida, HShinagawa, YMaruyama, TOhuchida, SNakai, HKondo, KToda, M Design and synthesis of a highly selective EP4-receptor agonist. Part 2: 5-thia and 9beta-haloPG derivatives with improved stability. Bioorg Med Chem Lett 11:2033-5 (2001)  
Target
Name:
Prostacyclin receptor
Synonyms:
PGI receptor PRIPR Prostacyclin (IP) Receptor Prostaglandin I Prostaglandin I2 receptor | Prostanoid IP receptor
Type:
G Protein-Coupled Receptor (GPCR)
Mol. Mass.:
40968.22
Organism:
Homo sapiens (Human)
Description:
The membranes prepared from human platelet were used in binding assay.
Residue:
386
  
Inhibitor
Name:
BDBM50101836
Synonyms:
6-[(S)-(R)-3-Hydroxy-2-((1S,2R)-3-hydroxy-oct-1-enyl)-5-oxo-cyclopentylsulfanyl]-hexanoic acid | CHEMBL294108
Type:
Small organic molecule
Emp. Form.:
C19H32O5S
Mol. Mass.:
372.519
SMILES:
CCCCC[C@H](O)\C=C\[C@H]1[C@H](O)CC(=O)[C@@H]1SCCCCCC(O)=O
: