Target
5-hydroxytryptamine receptor 2A
Ligand
BDBM50544627
Substrate
Meas. Tech.
ChEMBL_1993282 (CHEMBL4627017)
Ki
3.0±n/a nM
Citation
 Poulie, CBMLiu, NJensen, AABunch, L Design, Synthesis, and Pharmacological Characterization of Heterobivalent Ligands for the Putative 5-HT J Med Chem 63:9928-9949 (2020)  
Target
Name:
5-hydroxytryptamine receptor 2A
Synonyms:
5-HT-2 5-HT2A 5-hydroxytryptamine receptor 2A (5HT-2A) 5HT2A_HUMAN HTR2A | Serotonin receptor 2A
Type:
undefined
Mol. Mass.:
52607.65
Organism:
Homo sapiens (Human)
Description:
P28223
Residue:
471
  
Inhibitor
Name:
BDBM50544627
Synonyms:
CHEMBL4636980
Type:
Small organic molecule
Emp. Form.:
C24H30FNO4
Mol. Mass.:
415.4977
SMILES:
COCCOc1cccc(C(=O)C2CCN(CCc3ccc(F)cc3)CC2)c1OC
: