Target
Sodium-dependent serotonin transporter
Ligand
BDBM50102405
Substrate
Meas. Tech.
ChEMBL_201964 (CHEMBL882257)
Ki
95±n/a nM
Citation
 Martínez-Esparza, JOficialdegui, AMPérez-Silanes, SHeras, BOrús, LPalop, JALasheras, BRoca, JMourelle, MBosch, ADel Castillo, JCTordera, RDel Río, JMonge, A New 1-aryl-3-(4-arylpiperazin-1-yl)propane derivatives, with dual action at 5-HT1A serotonin receptors and serotonin transporter, as a new class of antidepressants. J Med Chem 44:418-28 (2001)  
Target
Name:
Sodium-dependent serotonin transporter
Synonyms:
5-HT Transporter 5HT transporter Anandamid membrane transporter, AMT Monoamine transporters; Norepinephrine & serotonin Slc6a4 Sodium-dependent serotonin transporter (SERT) | imipramine receptor
Type:
Multi-pass membrane protein
Mol. Mass.:
70168.43
Organism:
Rattus norvegicus (rat)
Description:
P31652
Residue:
630
  
Inhibitor
Name:
BDBM50102405
Synonyms:
1-(benzo[b]thiophen-3-yl)-3-(4-(2-methoxyphenyl)piperazin-1-yl)propan-1-one oxime CHEMBL439978
Type:
Small organic molecule
Emp. Form.:
C22H25N3O2S
Mol. Mass.:
395.518
SMILES:
COc1ccccc1N1CCN(CCC(N=O)c2csc3ccccc23)CC1
: