Target
5-hydroxytryptamine receptor 1A
Ligand
BDBM50102405
Substrate
Meas. Tech.
ChEMBL_1160 (CHEMBL616105)
Ki
60±n/a nM
Citation
 Martínez-Esparza, JOficialdegui, AMPérez-Silanes, SHeras, BOrús, LPalop, JALasheras, BRoca, JMourelle, MBosch, ADel Castillo, JCTordera, RDel Río, JMonge, A New 1-aryl-3-(4-arylpiperazin-1-yl)propane derivatives, with dual action at 5-HT1A serotonin receptors and serotonin transporter, as a new class of antidepressants. J Med Chem 44:418-28 (2001)  
Target
Name:
5-hydroxytryptamine receptor 1A
Synonyms:
5-HT-1A 5-HT1A 5-hydroxytryptamine receptor 1A (5HT1A) 5ht1a Htr1a Serotonin 1a (5-HT1a) receptor/Adrenergic receptor alpha-1 | Serotonin receptor 1A
Type:
G Protein-Coupled Receptor (GPCR)
Mol. Mass.:
46445.29
Organism:
Rattus norvegicus (rat)
Description:
Binding assays were performed using rat hippocampal membranes.
Residue:
422
  
Inhibitor
Name:
BDBM50102405
Synonyms:
1-(benzo[b]thiophen-3-yl)-3-(4-(2-methoxyphenyl)piperazin-1-yl)propan-1-one oxime CHEMBL439978
Type:
Small organic molecule
Emp. Form.:
C22H25N3O2S
Mol. Mass.:
395.518
SMILES:
COc1ccccc1N1CCN(CCC(N=O)c2csc3ccccc23)CC1
: