Target
Phosphatidylcholine:ceramide cholinephosphotransferase 1
Ligand
BDBM50545122
Substrate
Meas. Tech.
ChEMBL_1994373 (CHEMBL4628268)
IC50
3400±n/a nM
Citation
 Yukawa, TNakahata, TOkamoto, RIshichi, YMiyamoto, YNishimura, SOikawa, TKubo, KAdachi, RSatomi, YNakakariya, MAmano, NKamaura, MMatsunaga, N Discovery of 1,8-naphthyridin-2-one derivative as a potent and selective sphingomyelin synthase 2 inhibitor. Bioorg Med Chem 28:0 (2020)  
Target
Name:
Phosphatidylcholine:ceramide cholinephosphotransferase 1
Synonyms:
MOB Protein Mob SMS1 Sphingomyelin synthase 1 Transmembrane protein 23
Type:
PROTEIN
Mol. Mass.:
48630.99
Organism:
Homo sapiens (Human)
Description:
ChEMBL_109868
Residue:
413
  
Inhibitor
Name:
BDBM50545122
Synonyms:
CHEMBL4646354
Type:
Small organic molecule
Emp. Form.:
C34H39F6N3O5
Mol. Mass.:
683.681
SMILES:
CN(Cc1cc(cc(c1)C(F)(F)F)C(F)(F)F)C(=O)c1c(OCCCC2CCN(CC2)C(=O)OC(C)(C)C)c2ccccc2n(C)c1=O
: