Target
Phosphatidylcholine:ceramide cholinephosphotransferase 1
Ligand
BDBM50545124
Substrate
Meas. Tech.
ChEMBL_1994373 (CHEMBL4628268)
IC50
15000±n/a nM
Citation
 Yukawa, TNakahata, TOkamoto, RIshichi, YMiyamoto, YNishimura, SOikawa, TKubo, KAdachi, RSatomi, YNakakariya, MAmano, NKamaura, MMatsunaga, N Discovery of 1,8-naphthyridin-2-one derivative as a potent and selective sphingomyelin synthase 2 inhibitor. Bioorg Med Chem 28:0 (2020)  
Target
Name:
Phosphatidylcholine:ceramide cholinephosphotransferase 1
Synonyms:
MOB Protein Mob SMS1 Sphingomyelin synthase 1 Transmembrane protein 23
Type:
PROTEIN
Mol. Mass.:
48630.99
Organism:
Homo sapiens (Human)
Description:
ChEMBL_109868
Residue:
413
  
Inhibitor
Name:
BDBM50545124
Synonyms:
CHEMBL4639746
Type:
Small organic molecule
Emp. Form.:
C36H49N3O7
Mol. Mass.:
635.7902
SMILES:
CCOc1cc(CN(C)C(=O)c2c(OCCCC3CCN(CC3)C(=O)OC(C)(C)C)c3ccccc3n(C)c2=O)cc(OCC)c1
: