Target
Phosphatidylcholine:ceramide cholinephosphotransferase 1
Ligand
BDBM50545126
Substrate
Meas. Tech.
ChEMBL_1994373 (CHEMBL4628268)
IC50
10000±n/a nM
Citation
 Yukawa, TNakahata, TOkamoto, RIshichi, YMiyamoto, YNishimura, SOikawa, TKubo, KAdachi, RSatomi, YNakakariya, MAmano, NKamaura, MMatsunaga, N Discovery of 1,8-naphthyridin-2-one derivative as a potent and selective sphingomyelin synthase 2 inhibitor. Bioorg Med Chem 28:0 (2020)  
Target
Name:
Phosphatidylcholine:ceramide cholinephosphotransferase 1
Synonyms:
MOB Protein Mob SMS1 Sphingomyelin synthase 1 Transmembrane protein 23
Type:
PROTEIN
Mol. Mass.:
48630.99
Organism:
Homo sapiens (Human)
Description:
ChEMBL_109868
Residue:
413
  
Inhibitor
Name:
BDBM50545126
Synonyms:
CHEMBL4646540
Type:
Small organic molecule
Emp. Form.:
C33H44N4O7
Mol. Mass.:
608.7251
SMILES:
COc1cc(CN(C)C(=O)c2c(OCCCC3CCN(CC3)C(=O)OC(C)(C)C)c3cccnc3n(C)c2=O)cc(OC)c1
: