Target
Phosphatidylcholine:ceramide cholinephosphotransferase 1
Ligand
BDBM50545128
Substrate
Meas. Tech.
ChEMBL_1994373 (CHEMBL4628268)
IC50
850±n/a nM
Citation
 Yukawa, TNakahata, TOkamoto, RIshichi, YMiyamoto, YNishimura, SOikawa, TKubo, KAdachi, RSatomi, YNakakariya, MAmano, NKamaura, MMatsunaga, N Discovery of 1,8-naphthyridin-2-one derivative as a potent and selective sphingomyelin synthase 2 inhibitor. Bioorg Med Chem 28:0 (2020)  
Target
Name:
Phosphatidylcholine:ceramide cholinephosphotransferase 1
Synonyms:
MOB Protein Mob SMS1 Sphingomyelin synthase 1 Transmembrane protein 23
Type:
PROTEIN
Mol. Mass.:
48630.99
Organism:
Homo sapiens (Human)
Description:
ChEMBL_109868
Residue:
413
  
Inhibitor
Name:
BDBM50545128
Synonyms:
CHEMBL4641888
Type:
Small organic molecule
Emp. Form.:
C33H36F6N4O5
Mol. Mass.:
682.6532
SMILES:
CN(Cc1cc(cc(c1)C(F)(F)F)C(F)(F)F)C(=O)c1c(OCCCC2CCN(CC2)C(=O)OC2(C)CC2)c2cccnc2n(C)c1=O
: