Target
Serine protease 1
Ligand
BDBM50102788
Substrate
Meas. Tech.
ChEMBL_212739 (CHEMBL816557)
Ki
30000±n/a nM
Citation
 Verner, EKatz, BASpencer, JRAllen, DHataye, JHruzewicz, WHui, HCKolesnikov, ALi, YLuong, CMartelli, ARadika, KRai, RShe, MShrader, WSprengeler, PATrapp, SWang, JYoung, WBMackman, RL Development of serine protease inhibitors displaying a multicentered short (<2.3 A) hydrogen bond binding mode: inhibitors of urokinase-type plasminogen activator and factor Xa. J Med Chem 44:2753-71 (2001)  
Target
Name:
Serine protease 1
Synonyms:
Alpha-trypsin chain 1 Beta-trypsin PRSS1 TRP1 TRY1_HUMAN Thrombin & trypsin Trypsin I | Trypsin-1
Type:
Enzyme
Mol. Mass.:
26557.80
Organism:
Homo sapiens (Human)
Description:
P07477
Residue:
247
  
Inhibitor
Name:
BDBM50102788
Synonyms:
2-(2-Hydroxy-3-methoxy-phenyl)-1H-benzoimidazole-5-carboxamidine | CHEMBL94139
Type:
Small organic molecule
Emp. Form.:
C15H14N4O2
Mol. Mass.:
282.2973
SMILES:
COc1cccc(-c2nc3ccc(cc3[nH]2)C(N)=N)c1O
: