Target
Prothrombin
Ligand
BDBM50102792
Substrate
Meas. Tech.
ChEMBL_208347 (CHEMBL813657)
Ki
240±n/a nM
Citation
 Verner, EKatz, BASpencer, JRAllen, DHataye, JHruzewicz, WHui, HCKolesnikov, ALi, YLuong, CMartelli, ARadika, KRai, RShe, MShrader, WSprengeler, PATrapp, SWang, JYoung, WBMackman, RL Development of serine protease inhibitors displaying a multicentered short (<2.3 A) hydrogen bond binding mode: inhibitors of urokinase-type plasminogen activator and factor Xa. J Med Chem 44:2753-71 (2001)  
Target
Name:
Prothrombin
Synonyms:
Activation peptide fragment 1 Coagulation factor II Prothrombin precursor Thrombin heavy chain | Thrombin light chain
Type:
Protein
Mol. Mass.:
70029.57
Organism:
Homo sapiens (Human)
Description:
P00734
Residue:
622
  
Inhibitor
Name:
BDBM50102792
Synonyms:
2-(2-Hydroxy-3-bromo-5-nitro-phenyl)-1H-indole-5-carboxamidine | CHEMBL316334
Type:
Small organic molecule
Emp. Form.:
C15H11BrN4O3
Mol. Mass.:
375.177
SMILES:
NC(=N)c1ccc2[nH]c(cc2c1)-c1cc(cc(Br)c1O)[N+]([O-])=O
: