Target
Fibroblast growth factor receptor 3
Ligand
BDBM25118
Substrate
Meas. Tech.
ChEMBL_1995351 (CHEMBL4629246)
IC50
9.0±n/a nM
Citation
 Kuriwaki, IKameda, MHisamichi, HKikuchi, SIikubo, KKawamoto, YMoritomo, HKondoh, YAmano, YTateishi, YEchizen, YIwai, YNoda, ATomiyama, HSuzuki, THirano, M Structure-based drug design of 1,3,5-triazine and pyrimidine derivatives as novel FGFR3 inhibitors with high selectivity over VEGFR2. Bioorg Med Chem 28:0 (2020)  
Target
Name:
Fibroblast growth factor receptor 3
Synonyms:
CD_antigen: CD333 FGFR3 Fibroblast growth factor receptor JTK4
Type:
Protein
Mol. Mass.:
87699.57
Organism:
Homo sapiens (Human)
Description:
P22607
Residue:
806
  
Inhibitor
Name:
BDBM25118
Synonyms:
(3Z)-4-amino-5-fluoro-3-[5-(4-methylpiperazino)-1,3-dihydrobenzimidazol-2-ylidene]carbostyril CHEMBL522892 | CHIR-258
Type:
Small organic molecule
Emp. Form.:
C21H21FN6O
Mol. Mass.:
392.4294
SMILES:
CN1CCN(CC1)c1ccc2nc([nH]c2c1)-c1c(N)c2c(F)cccc2[nH]c1=O
: