Target
Calcium/calmodulin-dependent protein kinase type 1
Ligand
BDBM50545573
Substrate
Meas. Tech.
ChEMBL_1996001 (CHEMBL4629896)
IC50
1.000000±n/a nM
Citation
 Fromont, CAtzori, AKaur, DHashmi, LGreco, GCabanillas, ANguyen, HVJones, DHGarzón, MVarela, AStevenson, BIacobini, GPLenoir, MRajesh, SBox, CKumar, JGrant, PNovitskaya, VMorgan, JSorrell, FJRedondo, CKramer, AHarris, CJLeighton, BVickers, SPCheetham, SCKenyon, CGrabowska, AMOverduin, MBerditchevski, FWeston, CJKnapp, SFischer, PMButterworth, S Discovery of Highly Selective Inhibitors of Calmodulin-Dependent Kinases That Restore Insulin Sensitivity in the Diet-Induced Obesity  J Med Chem 63:6784-6801 (2020)  
Target
Name:
Calcium/calmodulin-dependent protein kinase type 1
Synonyms:
CAMK1 CaM kinase I alpha CaMKI-alpha KCC1A_HUMAN
Type:
PROTEIN
Mol. Mass.:
41325.04
Organism:
Homo sapiens (Human)
Description:
ChEMBL_655701
Residue:
370
  
Inhibitor
Name:
BDBM50545573
Synonyms:
CHEMBL4635883 | US11530193, Example 54
Type:
Small organic molecule
Emp. Form.:
C21H31N7O
Mol. Mass.:
397.5171
SMILES:
CC(C)c1cc(Nc2nc(ncc2C(N)=O)N2CCC[C@H](N)C2)cc(n1)C(C)C
: