Target
5-hydroxytryptamine receptor 1A
Ligand
BDBM50103836
Substrate
Meas. Tech.
ChEBML_1543
Ki
130±n/a nM
Citation
 Feenstra, RWde Moes, JHofma, JJKling, HKuipers, WLong, SKTulp, MTvan der Heyden, JAKruse, CG New 1-aryl-4-(biarylmethylene)piperazines as potential atypical antipsychotics sharing dopamine D(2)-receptor and serotonin 5-HT(1A)-receptor affinities. Bioorg Med Chem Lett 11:2345-9 (2001)  
Target
Name:
5-hydroxytryptamine receptor 1A
Synonyms:
5-HT-1A 5-hydroxytryptamine receptor 1A (5-HT-1A) ADRB2RL1 Dopamine D2 receptor and serotonin 1a receptor HTR1A | Serotonin receptor 1A
Type:
Mol. Mass.:
46122.49
Organism:
Homo sapiens (Human)
Description:
Residue:
422
  
Inhibitor
Name:
BDBM50103836
Synonyms:
7-(4-Biphenyl-3-ylmethyl-piperazin-1-yl)-3-methyl-3H-benzooxazol-2-one | CHEMBL306634
Type:
Small organic molecule
Emp. Form.:
C25H25N3O2
Mol. Mass.:
399.4849
SMILES:
Cn1c2cccc(N3CCN(Cc4cccc(c4)-c4ccccc4)CC3)c2oc1=O
: