Target
Tumor necrosis factor
Ligand
BDBM50545753
Substrate
Meas. Tech.
ChEMBL_1996514 (CHEMBL4630409)
Kd
82100±n/a nM
Citation
 Sun, WWu, YZheng, MYang, YLiu, YWu, CZhou, YZhang, YChen, LLi, H Discovery of an Orally Active Small-Molecule Tumor Necrosis Factor-? Inhibitor. J Med Chem 63:8146-8156 (2020)  
Target
Name:
Tumor necrosis factor
Synonyms:
Cachectin TNF-a TNFA TNFSF2 Tumor necrosis factor (TNFa) Tumor necrosis factor ligand superfamily member 2 Tumor necrosis factor, soluble form | tumor necrosis factor alpha
Type:
Enzyme
Mol. Mass.:
25645.11
Organism:
Homo sapiens (Human)
Description:
P01375
Residue:
233
  
Inhibitor
Name:
BDBM50545753
Synonyms:
CHEMBL4649816
Type:
Small organic molecule
Emp. Form.:
C16H16N6O
Mol. Mass.:
308.3378
SMILES:
O=C1C[C@@H](CN1Cc1ccccc1)Nc1ncnc2[nH]cnc12
: