Target
Transcription activator BRG1
Ligand
BDBM50504160
Substrate
Meas. Tech.
ChEMBL_1998349 (CHEMBL4650206)
Kd
19685±n/a nM
Citation
 Picaud, SLeonards, KLambert, JPDovey, OWells, CFedorov, OMonteiro, OFujisawa, TWang, CYLingard, HTallant, CNikbin, NGuetzoyan, LIngham, RLey, SVBrennan, PMuller, SSamsonova, AGingras, ACSchwaller, JVassiliou, GKnapp, SFilippakopoulos, P Promiscuous targeting of bromodomains by bromosporine identifies BET proteins as master regulators of primary transcription response in leukemia. Sci Adv 2:0 (2016) Target
Name:
Transcription activator BRG1
Synonyms:
ATP-dependent helicase SMARCA4 BRG1 Mitotic growth and transcription activator Protein brahma homolog 1 SMCA4_HUMAN SNF2B SWI/SNF-related matrix-associated actin-dependent regulator of chromatin subfamily A member 4
Type:
PROTEIN
Mol. Mass.:
184666.66
Organism:
Homo sapiens (Human)
Description:
ChEMBL_107968
Residue:
1647
  
Inhibitor
Name:
BDBM50504160
Synonyms:
CHEMBL3133807 | US11773085, Compound B25
Type:
Small organic molecule
Emp. Form.:
C17H20N6O4S
Mol. Mass.:
404.444
SMILES:
CCOC(=O)Nc1cc(nn2c(C)nnc12)-c1ccc(C)c(NS(C)(=O)=O)c1
: