Target
Matrix metalloproteinase-9
Ligand
BDBM50104003
Substrate
Meas. Tech.
ChEMBL_105230 (CHEMBL712561)
IC50
7±n/a nM
Citation
 Hanessian, SMoitessier, NGauchet, CViau, M N-Aryl sulfonyl homocysteine hydroxamate inhibitors of matrix metalloproteinases: further probing of the S(1), S(1)', and S(2)' pockets. J Med Chem 44:3066-73 (2001)  
Target
Name:
Matrix metalloproteinase-9
Synonyms:
67 kDa matrix metalloproteinase-9 92 kDa gelatinase CLG4B Gelatinase B MMP9 Matrix metalloproteinase 9 (MMP-9) Matrix metalloproteinase-9 (MMP9)
Type:
Enzyme
Mol. Mass.:
78452.28
Organism:
Homo sapiens (Human)
Description:
P14780
Residue:
707
  
Inhibitor
Name:
BDBM50104003
Synonyms:
CHEMBL105142 | N-Hydroxy-2-[isobutyl-(4-methoxy-benzenesulfonyl)-amino]-butyramide
Type:
Small organic molecule
Emp. Form.:
C15H24N2O5S
Mol. Mass.:
344.426
SMILES:
CCC(N(CC(C)C)S(=O)(=O)c1ccc(OC)cc1)C(=O)NO
: