Target
72 kDa type IV collagenase
Ligand
BDBM50104003
Substrate
Meas. Tech.
ChEMBL_104365 (CHEMBL716609)
IC50
53±n/a nM
Citation
 Hanessian, SMoitessier, NGauchet, CViau, M N-Aryl sulfonyl homocysteine hydroxamate inhibitors of matrix metalloproteinases: further probing of the S(1), S(1)', and S(2)' pockets. J Med Chem 44:3066-73 (2001)  
Target
Name:
72 kDa type IV collagenase
Synonyms:
72 kDa gelatinase CLG4A Gelatinase A (MMP-2) MMP2_HUMAN Matrix metalloproteinase-2 (MMP 2) Matrix metalloproteinases 2 (MMP-2) | TBE-1
Type:
Enzyme
Mol. Mass.:
73870.36
Organism:
Homo sapiens (Human)
Description:
P08253
Residue:
660
  
Inhibitor
Name:
BDBM50104003
Synonyms:
CHEMBL105142 | N-Hydroxy-2-[isobutyl-(4-methoxy-benzenesulfonyl)-amino]-butyramide
Type:
Small organic molecule
Emp. Form.:
C15H24N2O5S
Mol. Mass.:
344.426
SMILES:
CCC(N(CC(C)C)S(=O)(=O)c1ccc(OC)cc1)C(=O)NO
: