Target
Interstitial collagenase
Ligand
BDBM50104003
Substrate
Meas. Tech.
ChEMBL_105957 (CHEMBL715370)
IC50
384±n/a nM
Citation
 Hanessian, SMoitessier, NGauchet, CViau, M N-Aryl sulfonyl homocysteine hydroxamate inhibitors of matrix metalloproteinases: further probing of the S(1), S(1)', and S(2)' pockets. J Med Chem 44:3066-73 (2001)  
Target
Name:
Interstitial collagenase
Synonyms:
CLG MMP1 Matrix metalloproteinase-1 | Matrix metalloproteinase-1 (MMP-1)
Type:
Enzyme
Mol. Mass.:
54010.26
Organism:
Homo sapiens (Human)
Description:
P03956
Residue:
469
  
Inhibitor
Name:
BDBM50104003
Synonyms:
CHEMBL105142 | N-Hydroxy-2-[isobutyl-(4-methoxy-benzenesulfonyl)-amino]-butyramide
Type:
Small organic molecule
Emp. Form.:
C15H24N2O5S
Mol. Mass.:
344.426
SMILES:
CCC(N(CC(C)C)S(=O)(=O)c1ccc(OC)cc1)C(=O)NO
: