Target
Stromelysin-1
Ligand
BDBM50104003
Substrate
Meas. Tech.
ChEMBL_104709 (CHEMBL709522)
IC50
45±n/a nM
Citation
 Hanessian, SMoitessier, NGauchet, CViau, M N-Aryl sulfonyl homocysteine hydroxamate inhibitors of matrix metalloproteinases: further probing of the S(1), S(1)', and S(2)' pockets. J Med Chem 44:3066-73 (2001)  
Target
Name:
Stromelysin-1
Synonyms:
MMP-3 MMP3_HUMAN Matrix metalloproteinase 3 Matrix metalloproteinase-3 (MMP-3) SL-1 Stromelysin 1 | Transin-1
Type:
Enzyme
Mol. Mass.:
53973.13
Organism:
Homo sapiens (Human)
Description:
P08254
Residue:
477
  
Inhibitor
Name:
BDBM50104003
Synonyms:
CHEMBL105142 | N-Hydroxy-2-[isobutyl-(4-methoxy-benzenesulfonyl)-amino]-butyramide
Type:
Small organic molecule
Emp. Form.:
C15H24N2O5S
Mol. Mass.:
344.426
SMILES:
CCC(N(CC(C)C)S(=O)(=O)c1ccc(OC)cc1)C(=O)NO
: