Target
Bromodomain-containing protein 9
Ligand
BDBM50147620
Substrate
Meas. Tech.
ChEMBL_1998338 (CHEMBL4650195)
IC50
10±n/a nM
Citation
 Theodoulou, NHBamborough, PBannister, AJBecher, IBit, RAChe, KHChung, CWDittmann, ADrewes, GDrewry, DHGordon, LGrandi, PLeveridge, MLindon, MMichon, AMMolnar, JRobson, SCTomkinson, NCKouzarides, TPrinjha, RKHumphreys, PG Discovery of I-BRD9, a Selective Cell Active Chemical Probe for Bromodomain Containing Protein 9 Inhibition. J Med Chem 59:1425-39 (2016)  
Target
Name:
Bromodomain-containing protein 9
Synonyms:
BRD9 Bromodomain-containing protein 9 | Rhabdomyosarcoma antigen MU-RMS-40.8
Type:
PROTEIN
Mol. Mass.:
66994.30
Organism:
Homo sapiens (Human)
Description:
ChEMBL_108000
Residue:
597
  
Inhibitor
Name:
BDBM50147620
Synonyms:
CHEMBL3769507
Type:
Small organic molecule
Emp. Form.:
C22H22F3N3O3S2
Mol. Mass.:
497.554
SMILES:
CCn1cc(-c2cccc(c2)C(F)(F)F)c2sc(cc2c1=O)C(=N)NC1CCS(=O)(=O)CC1
: