Target
Glutathione reductase, mitochondrial
Ligand
BDBM50104665
Substrate
Meas. Tech.
ChEBML_72477
IC50
13900±n/a nM
Citation
 Chibale, KHaupt, HKendrick, HYardley, VSaravanamuthu, AFairlamb, AHCroft, SL Antiprotozoal and cytotoxicity evaluation of sulfonamide and urea analogues of quinacrine. Bioorg Med Chem Lett 11:2655-7 (2001)  
Target
Name:
Glutathione reductase, mitochondrial
Synonyms:
GLUR GSHR_HUMAN Glutathione reductase | Glutathione reductase (GR)
Type:
Enzyme
Mol. Mass.:
56271.52
Organism:
Homo sapiens (Human)
Description:
P00390
Residue:
522
  
Inhibitor
Name:
BDBM50104665
Synonyms:
CHEMBL89368 | Naphthalene-2-sulfonic acid [4-(6-chloro-2-methoxy-acridin-9-ylamino)-butyl]-amide
Type:
Small organic molecule
Emp. Form.:
C28H26ClN3O3S
Mol. Mass.:
520.042
SMILES:
COc1ccc2nc3cc(Cl)ccc3c(NCCCCNS(=O)(=O)c3ccc4ccccc4c3)c2c1
: