Target
Matrix metalloproteinase-9
Ligand
BDBM50546206
Substrate
Meas. Tech.
ChEMBL_2014874 (CHEMBL4668452)
Kd
2100±n/a nM
Citation
 Zipfel, PRochais, CBaranger, KRivera, SDallemagne, P Matrix Metalloproteinases as New Targets in Alzheimer's Disease: Opportunities and Challenges. J Med Chem 63:10705-10725 (2020)  
Target
Name:
Matrix metalloproteinase-9
Synonyms:
67 kDa matrix metalloproteinase-9 92 kDa gelatinase CLG4B Gelatinase B MMP9 Matrix metalloproteinase 9 (MMP-9) Matrix metalloproteinase-9 (MMP9)
Type:
Enzyme
Mol. Mass.:
78452.28
Organism:
Homo sapiens (Human)
Description:
P14780
Residue:
707
  
Inhibitor
Name:
BDBM50546206
Synonyms:
CHEMBL1409442
Type:
Small organic molecule
Emp. Form.:
C16H17F2N3O3S
Mol. Mass.:
369.386
SMILES:
CCCc1cc(O)nc(SCC(=O)Nc2ccc(OC(F)F)cc2)n1
: