Target
5'-nucleotidase
Ligand
BDBM50546284
Substrate
Meas. Tech.
ChEMBL_2015107 (CHEMBL4668685)
IC50
0.031000±n/a nM
Citation
 Lawson, KVKalisiak, JLindsey, EANewcomb, ETLeleti, MRDebien, LRosen, BRMiles, DHSharif, EUJeffrey, JLTan, JBLChen, AZhao, SXu, GFu, LJin, LPark, TWBerry, WMoschütz, SScaletti, ESträter, NWalker, NPYoung, SWWalters, MJSchindler, UPowers, JP Discovery of AB680: A Potent and Selective Inhibitor of CD73. J Med Chem 63:11448-11468 (2020)  
Target
Name:
5'-nucleotidase
Synonyms:
5'-NT 5NTD_HUMAN Ecto-5'-nucleotidase NT5 NTE
Type:
Enzyme
Mol. Mass.:
63371.54
Organism:
Homo sapiens (Human)
Description:
P21589
Residue:
574
  
Inhibitor
Name:
BDBM50546284
Synonyms:
CHEMBL4740465
Type:
Small organic molecule
Emp. Form.:
C19H23ClFN5O9P2
Mol. Mass.:
581.813
SMILES:
C[C@H](Nc1nc(Cl)nc2n(ncc12)[C@@H]1O[C@H](COP(O)(=O)CP(O)(O)=O)[C@@H](O)[C@H]1O)c1cccc(F)c1
: