Target
Histone deacetylase 1
Ligand
BDBM50105688
Substrate
Meas. Tech.
ChEMBL_205835 (CHEMBL810946)
EC50
22000±n/a nM
Citation
 Lavoie, RBouchain, GFrechette, SWoo, SHAbou-Khalil, ELeit, SFournel, MYan, PTTrachy-Bourget, MCBeaulieu, CLi, ZBesterman, JDelorme, D Design and synthesis of a novel class of histone deacetylase inhibitors. Bioorg Med Chem Lett 11:2847-50 (2001)  
Target
Name:
Histone deacetylase 1
Synonyms:
Cereblon/Histone deacetylase 1 HDAC1 Histone deacetylase 1 (HDAC1) RPD3L1
Type:
Enzyme
Mol. Mass.:
55090.27
Organism:
Homo sapiens (Human)
Description:
Q13547
Residue:
482
  
Inhibitor
Name:
BDBM50105688
Synonyms:
(E)-N-Hydroxy-3-[4-(3-trifluoromethyl-benzenesulfonylamino)-phenyl]-acrylamide N-hydroxy-3-(4-(3-(trifluoromethyl)phenylsulfonamido)phenyl)acrylamide | US8796330, 114
Type:
Small organic molecule
Emp. Form.:
C16H13F3N2O4S
Mol. Mass.:
386.346
SMILES:
ONC(=O)\C=C\c1ccc(NS(=O)(=O)c2cccc(c2)C(F)(F)F)cc1
: