Target
Cytochrome P450 2C19
Ligand
BDBM50105828
Substrate
Meas. Tech.
ChEMBL_51523 (CHEMBL660383)
IC50
20000±n/a nM
Citation
 Ha-Duong, NTDijols, SMarques-Soares, CMinoletti, CDansette, PMMansuy, D Synthesis of sulfaphenazole derivatives and their use as inhibitors and tools for comparing the active sites of human liver cytochromes P450 of the 2C subfamily. J Med Chem 44:3622-31 (2001)  
Target
Name:
Cytochrome P450 2C19
Synonyms:
(R)-limonene 6-monooxygenase (S)-limonene 7-monooxygenase CYP2C19 CYPIIC19 Cytochrome P450 2C19 [I331V] Cytochrome P450-254C Mephenytoin 4-hydroxylase P450-254C
Type:
Enzyme
Mol. Mass.:
55935.47
Organism:
Homo sapiens (Human)
Description:
P33261
Residue:
490
  
Inhibitor
Name:
BDBM50105828
Synonyms:
4-Allyl-N-methyl-N-(2-phenyl-2H-pyrazol-3-yl)-benzenesulfonamide | CHEMBL333704
Type:
Small organic molecule
Emp. Form.:
C19H19N3O2S
Mol. Mass.:
353.438
SMILES:
CN(c1ccnn1-c1ccccc1)S(=O)(=O)c1ccc(CC=C)cc1
: