Target
Macrophage migration inhibitory factor
Ligand
BDBM50547499
Substrate
Meas. Tech.
ChEMBL_2018482 (CHEMBL4672060)
Kd
6860±n/a nM
Citation
 Cirillo, PFAsojo, OAKhire, ULee, YMootien, SHegan, PSutherland, AGPeterson-Roth, ELedizet, MKoski, RAAnthony, KG Inhibition of Macrophage Migration Inhibitory Factor by a Chimera of Two Allosteric Binders. ACS Med Chem Lett 11:1843-1847 (2020)  
Target
Name:
Macrophage migration inhibitory factor
Synonyms:
GIF Glycosylation-inhibiting factor L-dopachrome tautomerase MIF/CD74 (Macrophage migration inhibitory factor and HLA-DR antigens-associated invariant chain) MMIF Macrophage migration inhibitory factor (MIF) | Phenylpyruvate tautomerase
Type:
Enzyme
Mol. Mass.:
12478.18
Organism:
Homo sapiens (Human)
Description:
P14174
Residue:
115
  
Inhibitor
Name:
BDBM50547499
Synonyms:
CHEMBL4785454
Type:
Small organic molecule
Emp. Form.:
C28H25N5O8S2
Mol. Mass.:
623.657
SMILES:
CC(C)C(=O)c1c(Cc2cccc(c2)\N=N\c2ccc3c(cc(c(N)c3c2O)S(O)(=O)=O)S(O)(=O)=O)nn2ccccc12
: