Target
Prothrombin
Ligand
BDBM50106052
Substrate
Meas. Tech.
ChEBML_208873
IC50
>10000±n/a nM
Citation
 Su, TWu, YDoughan, BJia, ZJWoolfrey, JHuang, BWong, PPark, GSinha, UScarborough, RMZhu, BY Design, synthesis, and SAR of amino acid derivatives as factor Xa inhibitors. Bioorg Med Chem Lett 11:2947-50 (2001)  
Target
Name:
Prothrombin
Synonyms:
Activation peptide fragment 1 Coagulation factor II Prothrombin precursor Thrombin heavy chain | Thrombin light chain
Type:
Protein
Mol. Mass.:
70029.57
Organism:
Homo sapiens (Human)
Description:
P00734
Residue:
622
  
Inhibitor
Name:
BDBM50106052
Synonyms:
3-Carbamimidoyl-N-[(S)-phenyl-(2'-sulfamoyl-biphenyl-4-ylcarbamoyl)-methyl]-benzamide | CHEMBL100666
Type:
Small organic molecule
Emp. Form.:
C28H25N5O4S
Mol. Mass.:
527.594
SMILES:
NC(=N)c1cccc(c1)C(=O)N[C@H](C(=O)Nc1ccc(cc1)-c1ccccc1S(N)(=O)=O)c1ccccc1
: