Target
Prothrombin
Ligand
BDBM50106238
Substrate
Meas. Tech.
ChEMBL_225572 (CHEMBL847929)
Ki
65000±n/a nM
Citation
 Mackman, RLKatz, BABreitenbucher, JGHui, HCVerner, ELuong, CLiu, LSprengeler, PA Exploiting subsite S1 of trypsin-like serine proteases for selectivity: potent and selective inhibitors of urokinase-type plasminogen activator. J Med Chem 44:3856-71 (2001)  
Target
Name:
Prothrombin
Synonyms:
Activation peptide fragment 1 Coagulation factor II Prothrombin precursor Thrombin heavy chain | Thrombin light chain
Type:
Protein
Mol. Mass.:
70029.57
Organism:
Homo sapiens (Human)
Description:
P00734
Residue:
622
  
Inhibitor
Name:
BDBM50106238
Synonyms:
4-Chloro-2-(2-hydroxy-biphenyl-3-yl)-1H-indole-5-carboxamidine | CHEMBL125153
Type:
Small organic molecule
Emp. Form.:
C21H16ClN3O
Mol. Mass.:
361.824
SMILES:
NC(=N)c1ccc2[nH]c(cc2c1Cl)-c1cccc(-c2ccccc2)c1O
: