Target
Urokinase-type plasminogen activator
Ligand
BDBM50106242
Substrate
Meas. Tech.
ChEMBL_226009 (CHEMBL842150)
Ki
2000±n/a nM
Citation
 Mackman, RLKatz, BABreitenbucher, JGHui, HCVerner, ELuong, CLiu, LSprengeler, PA Exploiting subsite S1 of trypsin-like serine proteases for selectivity: potent and selective inhibitors of urokinase-type plasminogen activator. J Med Chem 44:3856-71 (2001)  
Target
Name:
Urokinase-type plasminogen activator
Synonyms:
3.4.21.73 U-plasminogen activator Urokinase Urokinase-type plasminogen activator chain B Urokinase-type plasminogen activator short chain A uPA
Type:
Enzyme
Mol. Mass.:
48528.62
Organism:
Homo sapiens (Human)
Description:
P00749
Residue:
431
  
Inhibitor
Name:
BDBM50106242
Synonyms:
6-Hydroxy-2-(2-hydroxy-biphenyl-3-yl)-1H-indole-5-carboxamidine | CHEMBL127407
Type:
Small organic molecule
Emp. Form.:
C21H17N3O2
Mol. Mass.:
343.3786
SMILES:
NC(=N)c1cc2cc([nH]c2cc1O)-c1cccc(-c2ccccc2)c1O
: