Target
Tissue-type plasminogen activator
Ligand
BDBM50106241
Substrate
Meas. Tech.
ChEMBL_222779 (CHEMBL847108)
Ki
3900±n/a nM
Citation
 Mackman, RLKatz, BABreitenbucher, JGHui, HCVerner, ELuong, CLiu, LSprengeler, PA Exploiting subsite S1 of trypsin-like serine proteases for selectivity: potent and selective inhibitors of urokinase-type plasminogen activator. J Med Chem 44:3856-71 (2001)  
Target
Name:
Tissue-type plasminogen activator
Synonyms:
Alteplase Reteplase Thrombin receptor protein Tissue-type plasminogen activator (tPA) t-PA t-plasminogen activator
Type:
Enzyme
Mol. Mass.:
62931.08
Organism:
Homo sapiens (Human)
Description:
Residue:
562
  
Inhibitor
Name:
BDBM50106241
Synonyms:
2-(2-Hydroxy-biphenyl-3-yl)-6-methoxy-1H-indole-5-carboxamidine | CHEMBL126707
Type:
Small organic molecule
Emp. Form.:
C22H19N3O2
Mol. Mass.:
357.4052
SMILES:
COc1cc2[nH]c(cc2cc1C(N)=N)-c1cccc(c1O)-c1ccccc1
: