Target
Growth hormone secretagogue receptor type 1
Ligand
BDBM50546816
Substrate
Meas. Tech.
ChEMBL_2016806 (CHEMBL4670384)
Ki
3.0±n/a nM
Citation
 Haj Salah, KBMaingot, MBlayo, ALM''Kadmi, CDamian, MMary, SCantel, SNeasta, JOiry, CPéraldi-Roux, SFernandez, GRomero, GGPerello, MMarie, JBanères, JLFehrentz, JADenoyelle, S Development of Nonpeptidic Inverse Agonists of the Ghrelin Receptor (GHSR) Based on the 1,2,4-Triazole Scaffold. J Med Chem 63:10796-10815 (2020) Target
Name:
Growth hormone secretagogue receptor type 1
Synonyms:
GH-releasing peptide receptor GHS-R GHSR_HUMAN Ghrelin receptor | Ghrelin receptor 1a (GHS-R1a)
Type:
Receptor
Mol. Mass.:
41334.57
Organism:
Homo sapiens (Human)
Description:
Receptor binding studies use plasma membranes from LLC PK-1 cells transiently transfected with hGHSR1a.
Residue:
366
  
Inhibitor
Name:
BDBM50546816
Synonyms:
CHEMBL4777792
Type:
Small organic molecule
Emp. Form.:
C40H37N7O4
Mol. Mass.:
679.7663
SMILES:
COc1ccc(Cn2c(CCc3ccccc3)nnc2[C@@H](Cc2c[nH]c3ccccc23)NC(=O)CNC(=O)C(=C\c2ccc(O)cc2)\C#N)cc1
: