Target
L-lactate dehydrogenase A chain
Ligand
BDBM50250656
Substrate
Meas. Tech.
ChEMBL_2017133 (CHEMBL4670711)
Kd
0.110000±n/a nM
Citation
Target
Name:
L-lactate dehydrogenase A chain
Synonyms:
Cell proliferation-inducing gene 19 protein L-lactate dehydrogenase A Chain LDH-A LDHA Lactate dehydrogenase A (LDHA) | Renal carcinoma antigen NY-REN-59
Type:
Protein
Mol. Mass.:
36694.85
Organism:
Homo sapiens (Human)
Description:
P00338::PDB Code: 4ajp
Residue:
332
  
Inhibitor
Name:
BDBM50250656
Synonyms:
CHEMBL4081890 | US11247971, Cmpd ID 276
Type:
Small organic molecule
Emp. Form.:
C30H26N4O4S2
Mol. Mass.:
570.682
SMILES:
NS(=O)(=O)c1ccc(Cc2c(CC3CC3)n(nc2-c2cccc(c2)-c2ccccc2)-c2nc(cs2)C(O)=O)cc1
: