Target
L-lactate dehydrogenase A chain
Ligand
BDBM50546993
Substrate
Meas. Tech.
ChEMBL_2017133 (CHEMBL4670711)
Kd
0.066700±n/a nM
Citation
Target
Name:
L-lactate dehydrogenase A chain
Synonyms:
Cell proliferation-inducing gene 19 protein L-lactate dehydrogenase A Chain LDH-A LDHA Lactate dehydrogenase A (LDHA) | Renal carcinoma antigen NY-REN-59
Type:
Protein
Mol. Mass.:
36694.85
Organism:
Homo sapiens (Human)
Description:
P00338::PDB Code: 4ajp
Residue:
332
  
Inhibitor
Name:
BDBM50546993
Synonyms:
CHEMBL4748782 US11752138, Compound 249
Type:
Small organic molecule
Emp. Form.:
C31H24F2N4O4S3
Mol. Mass.:
650.738
SMILES:
Cc1ccc(s1)C#Cc1cc(ccc1F)-c1nn(c(CC2CC2)c1Cc1ccc(c(F)c1)S(N)(=O)=O)-c1nc(cs1)C(O)=O
: