Target
L-lactate dehydrogenase A chain
Ligand
BDBM50547002
Substrate
Meas. Tech.
ChEMBL_2017133 (CHEMBL4670711)
Kd
0.063400±n/a nM
Citation
Target
Name:
L-lactate dehydrogenase A chain
Synonyms:
Cell proliferation-inducing gene 19 protein L-lactate dehydrogenase A Chain LDH-A LDHA Lactate dehydrogenase A (LDHA) | Renal carcinoma antigen NY-REN-59
Type:
Protein
Mol. Mass.:
36694.85
Organism:
Homo sapiens (Human)
Description:
P00338::PDB Code: 4ajp
Residue:
332
  
Inhibitor
Name:
BDBM50547002
Synonyms:
CHEMBL4753379 US11752138, Compound 112
Type:
Small organic molecule
Emp. Form.:
C31H25FN4O4S3
Mol. Mass.:
632.748
SMILES:
Cc1ccc(s1)C#Cc1cccc(c1)-c1nn(c(CC2CC2)c1Cc1ccc(c(F)c1)S(N)(=O)=O)-c1nc(cs1)C(O)=O
: