Target
Substance-P receptor
Ligand
BDBM50106891
Substrate
Meas. Tech.
ChEBML_205389
IC50
1.4±n/a nM
Citation
 Gerspacher, MLa Vecchia, LMah, Rvon Sprecher, AAnderson, GPSubramanian, NHauser, KBammerlin, HKimmel, SPawelzik, VRyffel, KBall, HA Dual neurokinin NK(1)/NK(2) antagonists: N-[(R,R)-(E)-1-arylmethyl-3-(2-oxo-azepan-3-yl)carbamoyl]allyl-N-methyl-3,5-bis(trifluoromethyl)benzamides and 3-[N'-3,5-bis(trifluoromethyl)benzoyl-N-arylmethyl-N'-methylhydrazino]-N-[(R)-2-oxo-azepan-3-yl]propionamides. Bioorg Med Chem Lett 11:3081-4 (2001)  
Target
Name:
Substance-P receptor
Synonyms:
NK-1 receptor NK1 Receptor NK1R_HUMAN Neurokinin-1 (NK-1) SPR TACR1 Tachykinin receptor 1 (NK1) | tachykinin
Type:
G Protein-Coupled Receptor (GPCR)
Mol. Mass.:
46254.43
Organism:
Homo sapiens (Human)
Description:
P25103
Residue:
407
  
Inhibitor
Name:
BDBM50106891
Synonyms:
3-[N'-(3,5-Bis-trifluoromethyl-benzoyl)-N-(3,4-dichloro-benzyl)-N'-methyl-hydrazino]-N-((R)-2-oxo-azepan-3-yl)-propionamide | CHEMBL318606
Type:
Small organic molecule
Emp. Form.:
C26H26Cl2F6N4O3
Mol. Mass.:
627.406
SMILES:
CN(N(CCC(=O)N[C@@H]1CCCCNC1=O)Cc1ccc(Cl)c(Cl)c1)C(=O)c1cc(cc(c1)C(F)(F)F)C(F)(F)F
: