Target
Relaxin-3 receptor 2
Ligand
BDBM50547991
Substrate
Meas. Tech.
ChEMBL_2019496 (CHEMBL4673074)
Ki
50±n/a nM
Citation
 Zhang, XBathgate, RADHossain, MA Human Insulin-like Peptide 5 (INSL5). Identification of a Simplified Version of Two-Chain Analog A13. ACS Med Chem Lett 11:2455-2460 (2020)  
Target
Name:
Relaxin-3 receptor 2
Synonyms:
G-protein coupled receptor 100 GPCR142 Insulin-like peptide INSL5 receptor RLN3 receptor 2 RXFP4 | Relaxin family peptide receptor 4
Type:
PROTEIN
Mol. Mass.:
41161.14
Organism:
Homo sapiens (Human)
Description:
ChEMBL_1456194
Residue:
374
  
Inhibitor
Name:
BDBM50547991
Synonyms:
CHEMBL4740938
Type:
Small organic molecule
Emp. Form.:
C163H263N45O50S5
Mol. Mass.:
3813.429
SMILES:
CC[C@H](C)[C@@H]1NC(=O)[C@H](Cc2ccc(O)cc2)NC(=O)[C@@H](NC(=O)[C@@H](NC(=O)[C@@H](NC(=O)[C@H](CCCNC(N)=N)NC(=O)[C@@H](NC(=O)[C@H](Cc2ccc(O)cc2)NC(=O)[C@H](CCC(O)=O)NC(=O)[C@H](CC(C)C)NC(=O)CNC(=O)[C@H](CSSC[C@H](N)C(=O)N[C@@H]([C@@H](C)O)C(=O)N[C@@H](CC(O)=O)C(=O)NCC(=O)N[C@@H](C)C(=O)N[C@@H](CO)C(=O)N[C@@H](CCSC)C(=O)N[C@@H](CCCCN)C(=O)N[C@@H](CC(O)=O)C(=O)N[C@@H](CC(C)C)C(=O)N[C@@H](CO)C(=O)N[C@@H](C)C(=O)N[C@@H](CC(C)C)C(=O)N[C@@H](CSSC[C@H](NC1=O)C(=O)N[C@@H](C)C(=O)N[C@@H](CO)C(=O)N[C@@H](CO)C(=O)N[C@@H](CCCNC(N)=N)C(=O)N[C@@H](Cc1c[nH]c2ccccc12)C(O)=O)C(O)=O)NC(=O)[C@H](CC(C)C)NC(=O)[C@@H](N)CCCNC(N)=N)[C@@H](C)CC)[C@@H](C)O)C(C)C)[C@@H](C)CC
: