Target
Peroxisome proliferator-activated receptor gamma
Ligand
BDBM50106963
Substrate
Meas. Tech.
ChEMBL_154353 (CHEMBL759115)
Ki
620±n/a nM
Citation
 Liu, KGLambert, MHAyscue, AHHenke, BRLeesnitzer, LMOliver, WRPlunket, KDXu, HESternbach, DDWillson, TM Synthesis and biological activity of L-tyrosine-based PPARgamma agonists with reduced molecular weight. Bioorg Med Chem Lett 11:3111-3 (2001)  
Target
Name:
Peroxisome proliferator-activated receptor gamma
Synonyms:
NR1C3 PPAR-gamma PPARG_HUMAN Peroxisome proliferator-activated receptor gamma (PPAR gamma) Peroxisome proliferator-activated receptor gamma (PPARĪ³) peroxisome proliferator-activated receptor gamma isoform 2
Type:
Nuclear Receptor
Mol. Mass.:
57613.46
Organism:
Homo sapiens (Human)
Description:
P37231
Residue:
505
  
Inhibitor
Name:
BDBM50106963
Synonyms:
(S)-2-Methanesulfonylamino-3-{4-[2-(5-methyl-2-phenyl-oxazol-4-yl)-ethoxy]-phenyl}-propionic acid | CHEMBL105088
Type:
Small organic molecule
Emp. Form.:
C22H24N2O6S
Mol. Mass.:
444.501
SMILES:
Cc1oc(nc1CCOc1ccc(C[C@H](NS(C)(=O)=O)C(O)=O)cc1)-c1ccccc1
: