Target
Prothrombin
Ligand
BDBM50107066
Substrate
Meas. Tech.
ChEBML_225578
Ki
180±n/a nM
Citation
 Lévesque, SSt-Denis, YBachand, BPréville, PLeblond, LWinocour, PDEdmunds, JJRubin, JRSiddiqui, MA Novel bicyclic lactam inhibitors of thrombin: potency and selectivity optimization through P1 residues. Bioorg Med Chem Lett 11:3161-4 (2001)  
Target
Name:
Prothrombin
Synonyms:
Activated blood-coagulation factor II Activation peptide fragment 2 Blood-coagulation factor IIa E thrombin Factor IIa Gamma-thrombin THRB_RAT Thrombin Thrombin light chain Thrombofort | Tropostasin
Type:
Protein
Mol. Mass.:
70413.05
Organism:
Rattus norvegicus
Description:
P18292
Residue:
617
  
Inhibitor
Name:
BDBM50107066
Synonyms:
(6S,8aS)-4-Oxo-2-(3-phenyl-propionyl)-octahydro-pyrrolo[1,2-a]pyrazine-6-carboxylic acid (1-carbamimidoyl-piperidin-4-ylmethyl)-amide | CHEMBL17715
Type:
Small organic molecule
Emp. Form.:
C24H34N6O3
Mol. Mass.:
454.5652
SMILES:
NC(=N)N1CCC(CNC(=O)[C@@H]2CC[C@H]3CN(CC(=O)N23)C(=O)CCc2ccccc2)CC1
: