Target
Sigma non-opioid intracellular receptor 1
Ligand
BDBM50107226
Substrate
Meas. Tech.
ChEMBL_223691 (CHEMBL846101)
Ki
6.3±n/a nM
Citation
 Huang, YHammond, PSWu, LMach, RH Synthesis and structure-activity relationships of N-(1-benzylpiperidin-4-yl)arylacetamide analogues as potent sigma1 receptor ligands. J Med Chem 44:4404-15 (2001)  
Target
Name:
Sigma non-opioid intracellular receptor 1
Synonyms:
Aging-associated gene 8 protein SGMR1_HUMAN SIGMAR1 SR31747-binding protein Sigma 1-type opioid receptor Sigma1R | hSigmaR1
Type:
Enzyme Catalytic Domain
Mol. Mass.:
25124.85
Organism:
Homo sapiens (Human)
Description:
Q99720
Residue:
223
  
Inhibitor
Name:
BDBM50107226
Synonyms:
CHEMBL344023 | N-[1-(3,4-Difluoro-benzyl)-piperidin-4-yl]-2-phenyl-acetamide
Type:
Small organic molecule
Emp. Form.:
C20H22F2N2O
Mol. Mass.:
344.3983
SMILES:
Fc1ccc(CN2CCC(CC2)NC(=O)Cc2ccccc2)cc1F
: