Target
Mitogen-activated protein kinase 15
Ligand
BDBM50548060
Substrate
Meas. Tech.
ChEMBL_2019828 (CHEMBL4673641)
IC50
110±n/a nM
Target
Name:
Mitogen-activated protein kinase 15
Synonyms:
ERK-8 ERK8 MAPK15 Mitogen-activated protein kinase 15
Type:
Serine/threonine-protein kinase
Mol. Mass.:
59850.14
Organism:
Homo sapiens (Human)
Description:
gi_95147356
Residue:
544
  
Inhibitor
Name:
BDBM50548060
Synonyms:
CHEMBL4762609
Type:
Small organic molecule
Emp. Form.:
C22H25F2N7O2
Mol. Mass.:
457.4764
SMILES:
Fc1ccc(CC(=O)N2CCC(CC2)Nc2ncc3c(n[nH]c3n2)N2CCOCC2)cc1F
: