Target
Potassium voltage-gated channel subfamily H member 2
Ligand
BDBM50548358
Substrate
Meas. Tech.
ChEMBL_2021863 (CHEMBL4675676)
IC50
3600±n/a nM
Citation
 Grimster, NPGingipalli, LBarlaam, BSu, QZheng, XWatson, DWang, HSimpson, IPike, ABalazs, ABoiko, SIkeda, TPImpastato, ACJones, NHKawatkar, SKemmitt, PLamont, SPatel, JRead, JSarkar, USha, LTomlinson, RCWang, HWilson, DMZehnder, TEWang, LWang, PGoldberg, FWShao, WFawell, SDry, HDowling, JEEdmondson, SD Optimization of a series of potent, selective and orally bioavailable SYK inhibitors. Bioorg Med Chem Lett 30:0 (2020)  
Target
Name:
Potassium voltage-gated channel subfamily H member 2
Synonyms:
1,3-beta-glucan synthase component GLS2 ERG Eag-related protein 1 Ether-a-go-go-related gene (HERG) Ether-a-go-go-related gene potassium channel 1 Ether-a-go-go-related gene potassium channel 1 (hERG1) Ether-a-go-go-related protein 1 H-ERG KCNH2 Potassium voltage-gated channel subfamily H member 2 (hERG) Voltage-gated potassium channel subunit Kv11.1 hERG Potassium Channel 1 | putative potassium channel subunit
Type:
Multi-pass membrane protein
Mol. Mass.:
126672.65
Organism:
Homo sapiens (Human)
Description:
Q12809
Residue:
1159
  
Inhibitor
Name:
BDBM50548358
Synonyms:
CHEMBL4753141
Type:
Small organic molecule
Emp. Form.:
C21H25N9O2
Mol. Mass.:
435.4823
SMILES:
CNC(=O)c1nn(C)c2ccc(Nc3nccc(n3)-n3cc(CN(C)C)c(OC)n3)cc12
: