Target
Tyrosine-protein kinase ZAP-70
Ligand
BDBM50548363
Substrate
Meas. Tech.
ChEMBL_2021867 (CHEMBL4675680)
Kd
400±n/a nM
Citation
 Grimster, NPGingipalli, LBarlaam, BSu, QZheng, XWatson, DWang, HSimpson, IPike, ABalazs, ABoiko, SIkeda, TPImpastato, ACJones, NHKawatkar, SKemmitt, PLamont, SPatel, JRead, JSarkar, USha, LTomlinson, RCWang, HWilson, DMZehnder, TEWang, LWang, PGoldberg, FWShao, WFawell, SDry, HDowling, JEEdmondson, SD Optimization of a series of potent, selective and orally bioavailable SYK inhibitors. Bioorg Med Chem Lett 30:0 (2020)  
Target
Name:
Tyrosine-protein kinase ZAP-70
Synonyms:
70 kDa zeta-associated protein Syk-related tyrosine kinase Tyrosine-protein kinase ZAP-70 Tyrosine-protein kinase ZAP-70 (ZAP70) ZAP70 Zeta-chain (TCR) associated protein kinase 70kDa
Type:
Enzyme
Mol. Mass.:
69881.61
Organism:
Homo sapiens (Human)
Description:
ZAP-70 SH2 domain was expressed and purified from E. coli using O-phospho-L-tyrosine-agarose column.
Residue:
619
  
Inhibitor
Name:
BDBM50548363
Synonyms:
CHEMBL4753164
Type:
Small organic molecule
Emp. Form.:
C22H24N10O
Mol. Mass.:
444.4924
SMILES:
CN(C)Cc1cc(nn1C)-c1ccnc(Nc2ccn3c(C)nc(-c4nnc(C)o4)c3c2)n1
: