Target
Apolipoprotein B-100
Ligand
BDBM50107766
Substrate
Meas. Tech.
ChEMBL_217986 (CHEMBL824105)
IC50
10±n/a nM
Citation
 Ksander, GMdeJesus, RYuan, AFink, CMoskal, MCarlson, EKukkola, PBilci, NWallace, ENeubert, AFeldman, DMogelesky, TPoirier, KJeune, MSteele, RWasvery, JStephan, ZCahill, EWebb, RNavarrete, ALee, WGibson, JAlexander, NSharif, HHospattankar, A Diaminoindanes as microsomal triglyceride transfer protein inhibitors. J Med Chem 44:4677-87 (2001)  
Target
Name:
Apolipoprotein B-100
Synonyms:
APOB Apo B-100 Apolipoprotein B-100 | Apolipoprotein B-48
Type:
PROTEIN
Mol. Mass.:
515630.53
Organism:
Homo sapiens (Human)
Description:
ChEMBL_217986
Residue:
4563
  
Inhibitor
Name:
BDBM50107766
Synonyms:
(2-{5-[(6-Methyl-4'-trifluoromethyl-biphenyl-2-carbonyl)-amino]-indan-2-yl}-ethyl)-carbamic acid methyl ester | CHEMBL344801
Type:
Small organic molecule
Emp. Form.:
C28H27F3N2O3
Mol. Mass.:
496.5208
SMILES:
COC(=O)NCCC1Cc2ccc(NC(=O)c3cccc(C)c3-c3ccc(cc3)C(F)(F)F)cc2C1
: