Target
Gonadotropin-releasing hormone receptor
Ligand
BDBM50369965
Substrate
Meas. Tech.
ChEMBL_2022418 (CHEMBL4676231)
Kd
0.002±n/a nM
Citation
 Panknin, OWagenfeld, ABone, WBender, ENowak-Reppel, KFernández-Montalván, AENubbemeyer, RBäurle, SRing, SSchmees, NPrien, OSchäfer, MFriedrich, CZollner, TMSteinmeyer, AMueller, TLanger, G Discovery and Characterization of BAY 1214784, an Orally Available Spiroindoline Derivative Acting as a Potent and Selective Antagonist of the Human Gonadotropin-Releasing Hormone Receptor as Proven in a First-In-Human Study in Postmenopausal Women. J Med Chem 63:11854-11881 (2020)  
Target
Name:
Gonadotropin-releasing hormone receptor
Synonyms:
GNRHR GRHR GnRH-R Gonadotropin-releasing hormone receptor | Gonadotropin-releasing hormone receptor (GnRH)
Type:
Enzyme
Mol. Mass.:
37749.45
Organism:
Homo sapiens (Human)
Description:
P30968
Residue:
328
  
Inhibitor
Name:
BDBM50369965
Synonyms:
CETRORELIX | Cetrotide
Type:
Small organic molecule
Emp. Form.:
C70H92ClN17O14
Mol. Mass.:
1431.038
SMILES:
[#6]-[#6](-[#6])-[#6]-[#6@H](-[#7]-[#6](=O)-[#6@@H](-[#6]-[#6]-[#6]-[#7]-[#6](-[#7])=O)-[#7]-[#6](=O)-[#6@H](-[#6]-c1ccc(-[#8])cc1)-[#7]-[#6](=O)-[#6@H](-[#6]-[#8])-[#7]-[#6](=O)-[#6@@H](-[#6]-c1cccnc1)-[#7]-[#6](=O)-[#6@@H](-[#6]-c1ccc(Cl)cc1)-[#7]-[#6](=O)-[#6@@H](-[#6]-c1ccc2ccccc2c1)-[#7]-[#6](-[#6])=O)-[#6](=O)-[#7]-[#6@@H](-[#6]-[#6]-[#6]\[#7]=[#6](\[#7])-[#7])-[#6](=O)-[#7]-1-[#6]-[#6]-[#6]-[#6@H]-1-[#6](=O)-[#7]-[#6@H](-[#6])-[#6](-[#7])=O
: